Target
Peroxisome proliferator-activated receptor delta
Ligand
BDBM50194627
Substrate
Meas. Tech.
ChEMBL_822293 (CHEMBL2038596)
IC50
7±n/a nM
Citation
 Méndez-Lucio, OPérez-Villanueva, JCastillo, RMedina-Franco, JL Activity landscape modeling of PPAR ligands with dual-activity difference maps. Bioorg Med Chem 20:3523-32 (2012)  
Target
Name:
Peroxisome proliferator-activated receptor delta
Synonyms:
NR1C2 NUCI Nuclear receptor subfamily 1 group C member 2 PPAR-beta PPARD Peroxisome proliferator-activated receptor Peroxisome proliferator-activated receptor delta
Type:
Enzyme
Mol. Mass.:
49910.45
Organism:
Homo sapiens (Human)
Description:
Q03181
Residue:
441
  
Inhibitor
Name:
BDBM50194627
Synonyms:
(R)-3-(4-(3-(2-benzoyl-4-ethylphenoxy)butoxy)-2-methylphenyl)propanoic acid CHEMBL212911
Type:
Small organic molecule
Emp. Form.:
C29H32O5
Mol. Mass.:
460.5614
SMILES:
CCc1ccc(O[C@H](C)CCOc2ccc(CCC(O)=O)c(C)c2)c(c1)C(=O)c1ccccc1
: