Target
Peroxisome proliferator-activated receptor gamma
Ligand
BDBM50194627
Substrate
Meas. Tech.
ChEMBL_822294 (CHEMBL2038597)
IC50
11.99±n/a nM
Citation
 Méndez-Lucio, OPérez-Villanueva, JCastillo, RMedina-Franco, JL Activity landscape modeling of PPAR ligands with dual-activity difference maps. Bioorg Med Chem 20:3523-32 (2012)  
Target
Name:
Peroxisome proliferator-activated receptor gamma
Synonyms:
NR1C3 PPAR-gamma PPARG_HUMAN Peroxisome proliferator-activated receptor gamma (PPAR gamma) Peroxisome proliferator-activated receptor gamma (PPARĪ³) peroxisome proliferator-activated receptor gamma isoform 2
Type:
Nuclear Receptor
Mol. Mass.:
57613.46
Organism:
Homo sapiens (Human)
Description:
P37231
Residue:
505
  
Inhibitor
Name:
BDBM50194627
Synonyms:
(R)-3-(4-(3-(2-benzoyl-4-ethylphenoxy)butoxy)-2-methylphenyl)propanoic acid CHEMBL212911
Type:
Small organic molecule
Emp. Form.:
C29H32O5
Mol. Mass.:
460.5614
SMILES:
CCc1ccc(O[C@H](C)CCOc2ccc(CCC(O)=O)c(C)c2)c(c1)C(=O)c1ccccc1
: