Target
Adenosine receptor A2b
Ligand
BDBM50385947
Substrate
Meas. Tech.
ChEMBL_824763 (CHEMBL2044690)
EC50
739±n/a nM
Citation
 Hausler, NEDevine, SMMcRobb, FMWarfe, LPouton, CWHaynes, JMBottle, SEWhite, PJScammells, PJ Synthesis and pharmacological evaluation of dual acting antioxidant A(2A) adenosine receptor agonists. J Med Chem 55:3521-34 (2012)  
Target
Name:
Adenosine receptor A2b
Synonyms:
AA2BR_HUMAN ADORA2B Adenosine receptors A2b | Adenosine receptors; A2a & A2b
Type:
G Protein-Coupled Receptor (GPCR)
Mol. Mass.:
36341.22
Organism:
Homo sapiens (Human)
Description:
Residue:
332
  
Inhibitor
Name:
BDBM50385947
Synonyms:
CHEMBL2042303
Type:
Small organic molecule
Emp. Form.:
C28H38N8O5S2
Mol. Mass.:
630.782
SMILES:
CCNC(=O)[C@H]1O[C@H]([C@H](O)[C@@H]1O)n1cnc2c(N)nc(NCCc3ccc(NC(=O)CCCC[C@H]4CCSS4)cc3)nc12
: