Target
Adenosine receptor A3
Ligand
BDBM50385947
Substrate
Meas. Tech.
ChEMBL_824765 (CHEMBL2044692)
IC50
121±n/a nM
Citation
 Hausler, NEDevine, SMMcRobb, FMWarfe, LPouton, CWHaynes, JMBottle, SEWhite, PJScammells, PJ Synthesis and pharmacological evaluation of dual acting antioxidant A(2A) adenosine receptor agonists. J Med Chem 55:3521-34 (2012)  
Target
Name:
Adenosine receptor A3
Synonyms:
A3 adenosine receptor (hA3) ADORA3 | Adenosine A3 receptor (A3AR)
Type:
G Protein-Coupled Receptor (GPCR)
Mol. Mass.:
36197.32
Organism:
Homo sapiens (Human)
Description:
P0DMS8
Residue:
318
  
Inhibitor
Name:
BDBM50385947
Synonyms:
CHEMBL2042303
Type:
Small organic molecule
Emp. Form.:
C28H38N8O5S2
Mol. Mass.:
630.782
SMILES:
CCNC(=O)[C@H]1O[C@H]([C@H](O)[C@@H]1O)n1cnc2c(N)nc(NCCc3ccc(NC(=O)CCCC[C@H]4CCSS4)cc3)nc12
: