Target
P2X purinoceptor 7
Ligand
BDBM50386569
Substrate
Meas. Tech.
ChEMBL_826224 (CHEMBL2049235)
IC50
340±n/a nM
Citation
 Lee, WGLee, SDCho, JHJung, YKim, JHHien, TTKang, KWKo, HKim, YC Structure-activity relationships and optimization of 3,5-dichloropyridine derivatives as novel P2X(7) receptor antagonists. J Med Chem 55:3687-98 (2012)  
Target
Name:
P2X purinoceptor 7
Synonyms:
ATP receptor P2RX7_HUMAN P2X purinoceptor 7 (P2X7) P2Z receptor | Purinergic receptor
Type:
Protein
Mol. Mass.:
68602.85
Organism:
Homo sapiens (Human)
Description:
Q99572
Residue:
595
  
Inhibitor
Name:
BDBM50386569
Synonyms:
CHEMBL2048435
Type:
Small organic molecule
Emp. Form.:
C17H21Cl2N3O
Mol. Mass.:
354.274
SMILES:
Clc1cncc(Cl)c1NNC(=O)CC1C2CC3CC(C2)CC1C3
: