Target
P2X purinoceptor 7
Ligand
BDBM50386587
Substrate
Meas. Tech.
ChEMBL_826224 (CHEMBL2049235)
IC50
1400±n/a nM
Citation
 Lee, WGLee, SDCho, JHJung, YKim, JHHien, TTKang, KWKo, HKim, YC Structure-activity relationships and optimization of 3,5-dichloropyridine derivatives as novel P2X(7) receptor antagonists. J Med Chem 55:3687-98 (2012)  
Target
Name:
P2X purinoceptor 7
Synonyms:
ATP receptor P2RX7_HUMAN P2X purinoceptor 7 (P2X7) P2Z receptor | Purinergic receptor
Type:
Protein
Mol. Mass.:
68602.85
Organism:
Homo sapiens (Human)
Description:
Q99572
Residue:
595
  
Inhibitor
Name:
BDBM50386587
Synonyms:
CHEMBL2048263
Type:
Small organic molecule
Emp. Form.:
C15H15Cl2N3O
Mol. Mass.:
324.205
SMILES:
Cc1ccc(CCC(=O)NNc2c(Cl)cncc2Cl)cc1
: