Target
Sodium-dependent dopamine transporter
Ligand
BDBM50386903
Substrate
Meas. Tech.
ChEMBL_828548 (CHEMBL2050195)
Ki
12±n/a nM
Citation
 Qiao, HZhu, LLieberman, BPZha, ZPlössl, KKung, HF Synthesis and evaluation of novel tropane derivatives as potential PET imaging agents for the dopamine transporter. Bioorg Med Chem Lett 22:4303-6 (2012)  
Target
Name:
Sodium-dependent dopamine transporter
Synonyms:
DA transporter DAT1 Dopamine transporter protein (DAT) SC6A3_HUMAN Sodium-dependent dopamine transporter Solute carrier family 6 member 3
Type:
Multi-pass membrane protein
Mol. Mass.:
68497.11
Organism:
Homo sapiens (Human)
Description:
Q01959
Residue:
620
  
Inhibitor
Name:
BDBM50386903
Synonyms:
CHEMBL559741
Type:
Small organic molecule
Emp. Form.:
C20H25FINO2
Mol. Mass.:
457.3209
SMILES:
[H][C@@]12CC[C@]([H])([C@H]([C@@H](C1)c1ccc(C)cc1)C(=O)OCCF)N2C\C=C\I
: