Target
Sodium-dependent dopamine transporter
Ligand
BDBM50386909
Substrate
Meas. Tech.
ChEMBL_828549 (CHEMBL2050196)
Ki
135±n/a nM
Citation
 Qiao, HZhu, LLieberman, BPZha, ZPlössl, KKung, HF Synthesis and evaluation of novel tropane derivatives as potential PET imaging agents for the dopamine transporter. Bioorg Med Chem Lett 22:4303-6 (2012)  
Target
Name:
Sodium-dependent dopamine transporter
Synonyms:
DA transporter DAT1 Dopamine transporter protein (DAT) SC6A3_HUMAN Sodium-dependent dopamine transporter Solute carrier family 6 member 3
Type:
Multi-pass membrane protein
Mol. Mass.:
68497.11
Organism:
Homo sapiens (Human)
Description:
Q01959
Residue:
620
  
Inhibitor
Name:
BDBM50386909
Synonyms:
CHEMBL2048523
Type:
Small organic molecule
Emp. Form.:
C19H26ClFN2O
Mol. Mass.:
352.874
SMILES:
CN(C)C(=O)[C@@H]1[C@H]2CC[C@@H](C[C@@H]1c1ccc(Cl)cc1)N2CCCF
: