Target
Growth hormone secretagogue receptor type 1
Ligand
BDBM50386948
Substrate
Meas. Tech.
ChEMBL_827488 (CHEMBL2051345)
IC50
102±n/a nM
Citation
 Kung, DWCoffey, SBJones, RMCabral, SJiao, WFichtner, MCarpino, PARose, CRHank, RFLopaze, MGSwartz, RChen, HTHendsch, ZPosner, BWielis, CFManning, BDubins, JStock, IAVarma, SCampbell, MDeBartola, DKosa-Maines, RSteyn, SJMcClure, KF Identification of spirocyclic piperidine-azetidine inverse agonists of the ghrelin receptor. Bioorg Med Chem Lett 22:4281-7 (2012)  
Target
Name:
Growth hormone secretagogue receptor type 1
Synonyms:
GH-releasing peptide receptor GHS-R GHSR_HUMAN Ghrelin receptor | Ghrelin receptor 1a (GHS-R1a)
Type:
Receptor
Mol. Mass.:
41334.57
Organism:
Homo sapiens (Human)
Description:
Receptor binding studies use plasma membranes from LLC PK-1 cells transiently transfected with hGHSR1a.
Residue:
366
  
Inhibitor
Name:
BDBM50386948
Synonyms:
CHEMBL2048813
Type:
Small organic molecule
Emp. Form.:
C25H29N5O3
Mol. Mass.:
447.5295
SMILES:
COc1ccc(OCC(=O)N2CCC3(CN(Cc4ccc(cc4)-n4nccn4)C3)CC2)cc1
: