Target
Furin
Ligand
BDBM50386999
Substrate
Meas. Tech.
ChEMBL_827555 (CHEMBL2051583)
Ki
0.81±n/a nM
Citation
 López-Vallejo, FMartínez-Mayorga, K Furin inhibitors: importance of the positive formal charge and beyond. Bioorg Med Chem 20:4462-71 (2012)  
Target
Name:
Furin
Synonyms:
FUR FURIN_HUMAN PACE | PCSK3
Type:
Enzyme Catalytic Domain
Mol. Mass.:
86676.01
Organism:
Homo sapiens (Human)
Description:
P09958
Residue:
794
  
Inhibitor
Name:
BDBM50386999
Synonyms:
CHEMBL2049152
Type:
Small organic molecule
Emp. Form.:
C32H48N12O5
Mol. Mass.:
680.8009
SMILES:
[#6]-[#6](-[#6])-[#6@H](-[#7]-[#6](=O)-[#6@H](-[#6]-[#6]-[#6]\[#7]=[#6](/[#7])-[#7])-[#7]-[#6]-[#6](=O)-[#8]-c1ccccc1)-[#6](=O)-[#7]-[#6@@H](-[#6]-[#6]-[#6]\[#7]=[#6](\[#7])-[#7])-[#6](=O)-[#7]-c1ccc(cc1)-[#6](-[#7])=[#7]
: