Target
Prostaglandin D2 receptor 2
Ligand
BDBM50387188
Substrate
Meas. Tech.
ChEMBL_827958 (CHEMBL2051537)
IC50
81±n/a nM
Citation
 Pothier, JRiederer, MAPeter, OLeroy, XValdenaire, AGnerre, CFretz, H Novel 2-(2-(benzylthio)-1H-benzo[d]imidazol-1-yl)acetic acids: discovery and hit-to-lead evolution of a selective CRTh2 receptor antagonist chemotype. Bioorg Med Chem Lett 22:4660-4 (2012)  
Target
Name:
Prostaglandin D2 receptor 2
Synonyms:
CD_antigen=CD294 Chemoattractant Receptor-homologous molecule expressed on T-helper type 2 cells (CRTH2) Chemoattractant receptor-homologous molecule expressed on Th2 cells (CRTH2) G protein-coupled receptor 44 GPR44 PTGDR2 Prostaglandin D2 receptor 2 | Prostaglandin D2 receptor 2 (PGD2)
Type:
Enzyme
Mol. Mass.:
43295.45
Organism:
Homo sapiens (Human)
Description:
Q9Y5Y4
Residue:
395
  
Inhibitor
Name:
BDBM50387188
Synonyms:
CHEMBL2048199
Type:
Small organic molecule
Emp. Form.:
C22H24FN3O4S
Mol. Mass.:
445.507
SMILES:
CCCCNC(=O)c1ccc(OC)c(CSc2nc3cc(F)ccc3n2CC(O)=O)c1
: