Target
Prostaglandin D2 receptor 2
Ligand
BDBM50387199
Substrate
Meas. Tech.
ChEMBL_827957 (CHEMBL2051536)
IC50
4±n/a nM
Citation
 Pothier, JRiederer, MAPeter, OLeroy, XValdenaire, AGnerre, CFretz, H Novel 2-(2-(benzylthio)-1H-benzo[d]imidazol-1-yl)acetic acids: discovery and hit-to-lead evolution of a selective CRTh2 receptor antagonist chemotype. Bioorg Med Chem Lett 22:4660-4 (2012)  
Target
Name:
Prostaglandin D2 receptor 2
Synonyms:
CD_antigen=CD294 Chemoattractant Receptor-homologous molecule expressed on T-helper type 2 cells (CRTH2) Chemoattractant receptor-homologous molecule expressed on Th2 cells (CRTH2) G protein-coupled receptor 44 GPR44 PTGDR2 Prostaglandin D2 receptor 2 | Prostaglandin D2 receptor 2 (PGD2)
Type:
Enzyme
Mol. Mass.:
43295.45
Organism:
Homo sapiens (Human)
Description:
Q9Y5Y4
Residue:
395
  
Inhibitor
Name:
BDBM50387199
Synonyms:
CHEMBL2048197
Type:
Small organic molecule
Emp. Form.:
C24H19FN2O4S
Mol. Mass.:
450.482
SMILES:
COc1ccc(cc1CSc1nc2cc(F)ccc2n1CC(O)=O)C(=O)c1ccccc1
: