Target
Long-chain fatty acid transport protein 1
Ligand
BDBM50387709
Substrate
Meas. Tech.
ChEMBL_830658 (CHEMBL2061593)
IC50
>1000±n/a nM
Citation
 Matsufuji, TIkeda, MNaito, AHirouchi, MTakakusa, HKanda, SIzumi, MHarada, JShinozuka, T Discovery and optimization of novel fatty acid transport protein 1 (FATP1) inhibitors. Bioorg Med Chem Lett 22:5067-70 (2012)  
Target
Name:
Long-chain fatty acid transport protein 1
Synonyms:
6.2.1.- FATP-1 Fatty acid transport protein 1 SLC27A1 | Solute carrier family 27 member 1
Type:
PROTEIN
Mol. Mass.:
71123.97
Organism:
Homo sapiens (Human)
Description:
ChEMBL_956920
Residue:
646
  
Inhibitor
Name:
BDBM50387709
Synonyms:
CHEMBL2058086
Type:
Small organic molecule
Emp. Form.:
C20H23N5O2S
Mol. Mass.:
397.494
SMILES:
CCn1c(CNc2ccccc2)nnc1SCC(=O)Nc1ccc(OC)cc1
: