Target
Muscarinic acetylcholine receptor M1
Ligand
BDBM50387788
Substrate
Meas. Tech.
ChEMBL_828583 (CHEMBL2060098)
IC50
2500±n/a nM
Citation
 Melancon, BJUtley, TJSevel, CMattmann, MECheung, YYBridges, TMMorrison, RDSheffler, DJNiswender, CMDaniels, JSConn, PJLindsley, CWWood, MR Development of novel M1 antagonist scaffolds through the continued optimization of the MLPCN probe ML012. Bioorg Med Chem Lett 22:5035-40 (2012)  
Target
Name:
Muscarinic acetylcholine receptor M1
Synonyms:
ACM1_HUMAN Cholinergic receptor, muscarinic 1 | Cholinergic, muscarinic M1
Type:
Protein
Mol. Mass.:
51442.54
Organism:
Homo sapiens (Human)
Description:
P11229
Residue:
460
  
Inhibitor
Name:
BDBM50387788
Synonyms:
CHEMBL2058899
Type:
Small organic molecule
Emp. Form.:
C20H21F3N4O4S
Mol. Mass.:
470.465
SMILES:
FC(F)(F)Oc1ccccc1S(=O)(=O)N1CC(C1)C(=O)N1CCN(CC1)c1ccncc1
: