Target
Histone deacetylase 1
Ligand
BDBM50387965
Substrate
Meas. Tech.
ChEMBL_829144 (CHEMBL2059966)
IC50
1200±n/a nM
Citation
 Vaidya, ASKarumudi, BMendonca, EMadriaga, AAbdelkarim, Hvan Breemen, RBPetukhov, PA Design, synthesis, modeling, biological evaluation and photoaffinity labeling studies of novel series of photoreactive benzamide probes for histone deacetylase 2. Bioorg Med Chem Lett 22:5025-30 (2012)  
Target
Name:
Histone deacetylase 1
Synonyms:
Cereblon/Histone deacetylase 1 HDAC1 Histone deacetylase 1 (HDAC1) RPD3L1
Type:
Enzyme
Mol. Mass.:
55090.27
Organism:
Homo sapiens (Human)
Description:
Q13547
Residue:
482
  
Inhibitor
Name:
BDBM50387965
Synonyms:
CHEMBL2057824
Type:
Small organic molecule
Emp. Form.:
C17H13N5OS
Mol. Mass.:
335.383
SMILES:
Nc1ccc(cc1NC(=O)c1ccc(cc1)N=[N+]=[N-])-c1cccs1
: