Target
DNA gyrase subunit B
Ligand
BDBM50388095
Substrate
Meas. Tech.
ChEMBL_830517 (CHEMBL2061329)
IC50
39±n/a nM
Citation
 Manchester, JIDussault, DDRose, JABoriack-Sjodin, PAUria-Nickelsen, MIoannidis, GBist, SFleming, PHull, KG Discovery of a novel azaindole class of antibacterial agents targeting the ATPase domains of DNA gyrase and Topoisomerase IV. Bioorg Med Chem Lett 22:5150-6 (2012)  
Target
Name:
DNA gyrase subunit B
Synonyms:
DNA gyrase DNA gyrase subunit B (gyrB) gyrB
Type:
Enzyme Subunit
Mol. Mass.:
72530.91
Organism:
Staphylococcus aureus
Description:
Residue:
644
  
Inhibitor
Name:
BDBM50388095
Synonyms:
CHEMBL2059373
Type:
Small organic molecule
Emp. Form.:
C21H15F3N6O3
Mol. Mass.:
456.3774
SMILES:
OC(=O)c1cncc(c1)-c1cnc2[nH]c(cc2c1-n1ccc(n1)C(F)(F)F)C(=O)NC1CC1
: