Target
DNA gyrase subunit B
Ligand
BDBM50388096
Substrate
Meas. Tech.
ChEMBL_830517 (CHEMBL2061329)
IC50
133±n/a nM
Citation
 Manchester, JIDussault, DDRose, JABoriack-Sjodin, PAUria-Nickelsen, MIoannidis, GBist, SFleming, PHull, KG Discovery of a novel azaindole class of antibacterial agents targeting the ATPase domains of DNA gyrase and Topoisomerase IV. Bioorg Med Chem Lett 22:5150-6 (2012)  
Target
Name:
DNA gyrase subunit B
Synonyms:
DNA gyrase DNA gyrase subunit B (gyrB) gyrB
Type:
Enzyme Subunit
Mol. Mass.:
72530.91
Organism:
Staphylococcus aureus
Description:
Residue:
644
  
Inhibitor
Name:
BDBM50388096
Synonyms:
CHEMBL2059374
Type:
Small organic molecule
Emp. Form.:
C21H17F3N6O3
Mol. Mass.:
458.3933
SMILES:
CCNC(=O)c1cc2c(c(cnc2[nH]1)-c1cncc(c1)C(O)=O)-n1nc(cc1C)C(F)(F)F
: