Target
Glucose-6-phosphate 1-dehydrogenase
Ligand
BDBM50388482
Substrate
Meas. Tech.
ChEMBL_830110 (CHEMBL2061901)
IC50
31600±n/a nM
Citation
 Hamilton, NMDawson, MFairweather, EEHamilton, NSHitchin, JRJames, DIJones, SDJordan, AMLyons, AJSmall, HFThomson, GJWaddell, IDOgilvie, DJ Novel steroid inhibitors of glucose 6-phosphate dehydrogenase. J Med Chem 55:4431-45 (2012)  
Target
Name:
Glucose-6-phosphate 1-dehydrogenase
Synonyms:
G6PD Glucose 6-phosphate dehydrogenase (G6PD) glucose-6-phosphate 1-dehydrogenase isoform b
Type:
Enzyme
Mol. Mass.:
59258.58
Organism:
Homo sapiens (Human)
Description:
P11413
Residue:
515
  
Inhibitor
Name:
BDBM50388482
Synonyms:
CHEMBL1256760
Type:
Small organic molecule
Emp. Form.:
C21H34O3
Mol. Mass.:
334.4929
SMILES:
C[C@]12CC[C@H]3[C@@H](CC[C@H]4C[C@H](O)CC[C@]34C)[C@@H]1CC[C@@H]2C(=O)CO
: