Target
Glucose-6-phosphate 1-dehydrogenase
Ligand
BDBM50388511
Substrate
Meas. Tech.
ChEMBL_830110 (CHEMBL2061901)
IC50
34900±n/a nM
Citation
 Hamilton, NMDawson, MFairweather, EEHamilton, NSHitchin, JRJames, DIJones, SDJordan, AMLyons, AJSmall, HFThomson, GJWaddell, IDOgilvie, DJ Novel steroid inhibitors of glucose 6-phosphate dehydrogenase. J Med Chem 55:4431-45 (2012)  
Target
Name:
Glucose-6-phosphate 1-dehydrogenase
Synonyms:
G6PD Glucose 6-phosphate dehydrogenase (G6PD) glucose-6-phosphate 1-dehydrogenase isoform b
Type:
Enzyme
Mol. Mass.:
59258.58
Organism:
Homo sapiens (Human)
Description:
P11413
Residue:
515
  
Inhibitor
Name:
BDBM50388511
Synonyms:
CHEMBL2057316
Type:
Small organic molecule
Emp. Form.:
C24H40N2O3
Mol. Mass.:
404.586
SMILES:
CCNC(=O)NC1CC[C@@]2(C)[C@@H](CC[C@H]3[C@@H]4CC[C@H](C(=O)CO)[C@@]4(C)CC[C@H]23)C1
: