Target
M-phase inducer phosphatase 2
Ligand
BDBM50388539
Substrate
Meas. Tech.
ChEMBL_830415 (CHEMBL2061093)
IC50
9900±n/a nM
Citation
 Lavecchia, ADi Giovanni, CPesapane, AMontuori, NRagno, PMartucci, NMMasullo, MDe Vendittis, ENovellino, E Discovery of new inhibitors of Cdc25B dual specificity phosphatases by structure-based virtual screening. J Med Chem 55:4142-58 (2012)  
Target
Name:
M-phase inducer phosphatase 2
Synonyms:
CDC25B Dual specificity phosphatase (CDC25B) M-phase inducer phosphatase 2 (CDC25B) | MPIP2_HUMAN
Type:
Protein
Mol. Mass.:
64985.27
Organism:
Homo sapiens (Human)
Description:
Residue:
580
  
Inhibitor
Name:
BDBM50388539
Synonyms:
CHEMBL1408031
Type:
Small organic molecule
Emp. Form.:
C15H9N3O5
Mol. Mass.:
311.2491
SMILES:
OC(=O)c1cc(=O)[nH]c(NC2=CC(=O)C(=O)c3ccccc23)n1
: