Target
M-phase inducer phosphatase 2
Ligand
BDBM50388723
Substrate
Meas. Tech.
ChEMBL_829779 (CHEMBL2061298)
Ki
4700±n/a nM
Citation
 Mak, LHKnott, JScott, KAScott, CWhyte, GFYe, YMann, DJCes, OStivers, JWoscholski, R Arylstibonic acids are potent and isoform-selective inhibitors of Cdc25a and Cdc25b phosphatases. Bioorg Med Chem 20:4371-6 (2012)  
Target
Name:
M-phase inducer phosphatase 2
Synonyms:
CDC25B Dual specificity phosphatase (CDC25B) M-phase inducer phosphatase 2 (CDC25B) | MPIP2_HUMAN
Type:
Protein
Mol. Mass.:
64985.27
Organism:
Homo sapiens (Human)
Description:
Residue:
580
  
Inhibitor
Name:
BDBM50388723
Synonyms:
CHEMBL2057662
Type:
Small organic molecule
Emp. Form.:
C9H11O5Sb
Mol. Mass.:
320.94
SMILES:
OC(=O)CCc1cccc(c1)[Sb](O)(O)=O
: