Target
M-phase inducer phosphatase 2
Ligand
BDBM26613
Substrate
Meas. Tech.
ChEMBL_829779 (CHEMBL2061298)
Ki
369±n/a nM
Citation
 Mak, LHKnott, JScott, KAScott, CWhyte, GFYe, YMann, DJCes, OStivers, JWoscholski, R Arylstibonic acids are potent and isoform-selective inhibitors of Cdc25a and Cdc25b phosphatases. Bioorg Med Chem 20:4371-6 (2012)  
Target
Name:
M-phase inducer phosphatase 2
Synonyms:
CDC25B Dual specificity phosphatase (CDC25B) M-phase inducer phosphatase 2 (CDC25B) | MPIP2_HUMAN
Type:
Protein
Mol. Mass.:
64985.27
Organism:
Homo sapiens (Human)
Description:
Residue:
580
  
Inhibitor
Name:
BDBM26613
Synonyms:
(2E)-3-{3-[dihydroxy(oxo)--stibanyl]phenyl}prop-2-enoic acid | Compound 13778
Type:
Small organic molecule
Emp. Form.:
C9H9O5Sb
Mol. Mass.:
318.92
SMILES:
OC(=O)\C=C\c1cccc(c1)[Sb](O)(O)=O
: