Target
Apoptosis regulator Bcl-2
Ligand
BDBM50388993
Substrate
Meas. Tech.
ChEMBL_832857 (CHEMBL2066619)
IC50
1.7±n/a nM
Citation
 Zhou, HChen, JMeagher, JLYang, CYAguilar, ALiu, LBai, LCong, XCai, QFang, XStuckey, JAWang, S Design of Bcl-2 and Bcl-xL inhibitors with subnanomolar binding affinities based upon a new scaffold. J Med Chem 55:4664-82 (2012)  
Target
Name:
Apoptosis regulator Bcl-2
Synonyms:
Apoptosis regulator Bcl-2 Protein BCL-2 BCL2_HUMAN | Bcl-2 Protein
Type:
Homodimer or heterodimer
Mol. Mass.:
26269.11
Organism:
Homo sapiens (Human)
Description:
P10415
Residue:
239
  
Inhibitor
Name:
BDBM50388993
Synonyms:
CHEMBL2063896
Type:
Small organic molecule
Emp. Form.:
C46H48ClN7O6S2
Mol. Mass.:
894.5
SMILES:
CN(C)CC[C@H](CSc1ccccc1)Nc1ccc(cc1[N+]([O-])=O)S(=O)(=O)Nc1ccc(cc1)N1CCN(CC1)c1cccc(c1)-c1c(cn(C)c1C(O)=O)-c1ccc(Cl)cc1
: