Target
Apoptosis regulator Bcl-2
Ligand
BDBM50388990
Substrate
Meas. Tech.
ChEMBL_832857 (CHEMBL2066619)
Ki
1.2±n/a nM
Citation
 Zhou, HChen, JMeagher, JLYang, CYAguilar, ALiu, LBai, LCong, XCai, QFang, XStuckey, JAWang, S Design of Bcl-2 and Bcl-xL inhibitors with subnanomolar binding affinities based upon a new scaffold. J Med Chem 55:4664-82 (2012)  
Target
Name:
Apoptosis regulator Bcl-2
Synonyms:
Apoptosis regulator Bcl-2 Protein BCL-2 BCL2_HUMAN | Bcl-2 Protein
Type:
Homodimer or heterodimer
Mol. Mass.:
26269.11
Organism:
Homo sapiens (Human)
Description:
P10415
Residue:
239
  
Inhibitor
Name:
BDBM50388990
Synonyms:
CHEMBL2063893
Type:
Small organic molecule
Emp. Form.:
C47H51ClN8O5S2
Mol. Mass.:
907.541
SMILES:
CNC(=O)c1c(c(cn1C)-c1ccc(Cl)cc1)-c1cccc(c1)N1CCN(CC1)c1ccc(NS(=O)(=O)c2ccc(N[C@H](CCN(C)C)CSc3ccccc3)c(c2)[N+]([O-])=O)cc1
: