Target
Apoptosis regulator Bcl-2
Ligand
BDBM50388988
Substrate
Meas. Tech.
ChEMBL_832857 (CHEMBL2066619)
IC50
85.3±n/a nM
Citation
 Zhou, HChen, JMeagher, JLYang, CYAguilar, ALiu, LBai, LCong, XCai, QFang, XStuckey, JAWang, S Design of Bcl-2 and Bcl-xL inhibitors with subnanomolar binding affinities based upon a new scaffold. J Med Chem 55:4664-82 (2012)  
Target
Name:
Apoptosis regulator Bcl-2
Synonyms:
Apoptosis regulator Bcl-2 Protein BCL-2 BCL2_HUMAN | Bcl-2 Protein
Type:
Homodimer or heterodimer
Mol. Mass.:
26269.11
Organism:
Homo sapiens (Human)
Description:
P10415
Residue:
239
  
Inhibitor
Name:
BDBM50388988
Synonyms:
CHEMBL2063889
Type:
Small organic molecule
Emp. Form.:
C41H45ClN6O4S2
Mol. Mass.:
785.417
SMILES:
CN(C)CC[C@H](CSc1ccccc1)Nc1ccc(cc1[N+]([O-])=O)S(=O)(=O)Nc1ccc(cc1)N1CCN(Cc2ccccc2-c2ccc(Cl)cc2)CC1
: