Target
Apoptosis regulator Bcl-2
Ligand
BDBM50388983
Substrate
Meas. Tech.
ChEMBL_832857 (CHEMBL2066619)
IC50
1.3±n/a nM
Citation
 Zhou, HChen, JMeagher, JLYang, CYAguilar, ALiu, LBai, LCong, XCai, QFang, XStuckey, JAWang, S Design of Bcl-2 and Bcl-xL inhibitors with subnanomolar binding affinities based upon a new scaffold. J Med Chem 55:4664-82 (2012)  
Target
Name:
Apoptosis regulator Bcl-2
Synonyms:
Apoptosis regulator Bcl-2 Protein BCL-2 BCL2_HUMAN | Bcl-2 Protein
Type:
Homodimer or heterodimer
Mol. Mass.:
26269.11
Organism:
Homo sapiens (Human)
Description:
P10415
Residue:
239
  
Inhibitor
Name:
BDBM50388983
Synonyms:
CHEMBL2063883
Type:
Small organic molecule
Emp. Form.:
C57H71ClN10O7S2
Mol. Mass.:
1107.819
SMILES:
CN(C)CC[C@H](CSc1ccccc1)Nc1ccc(cc1[N+]([O-])=O)S(=O)(=O)Nc1ccc(cc1)N1CCN(CC1)c1cccc(c1)-c1c(cn(CC[C@H](O)CO)c1C(=O)NCCCN1CCN(C)CC1)-c1ccc(Cl)cc1
: