Target
Ketohexokinase
Ligand
BDBM50389321
Substrate
Meas. Tech.
ChEMBL_831738 (CHEMBL2065101)
IC50
28±n/a nM
Citation
 Maryanoff, BEO'Neill, JCMcComsey, DFYabut, SCLuci, DKGibbs, ACConnelly, MA Pyrimidinopyrimidine inhibitors of ketohexokinase: exploring the ring C2 group that interacts with Asp-27B in the ligand binding pocket. Bioorg Med Chem Lett 22:5326-9 (2012)  
Target
Name:
Ketohexokinase
Synonyms:
Hepatic fructokinase KHK_HUMAN Ketohexokinase (KHK) | Ketohexokinase (KHK) Isoform C
Type:
Enzyme Catalytic Domain
Mol. Mass.:
32521.64
Organism:
Homo sapiens (Human)
Description:
Residue:
298
  
Inhibitor
Name:
BDBM50389321
Synonyms:
CHEMBL2063927
Type:
Small organic molecule
Emp. Form.:
C26H35N9S
Mol. Mass.:
505.681
SMILES:
CSc1ccccc1Nc1nc(nc2c(NCC3CC3)ncnc12)N1CCC(CC1)N1CCNCC1
: