Target
Extracellular superoxide dismutase [Cu-Zn]
Ligand
BDBM50389791
Substrate
Meas. Tech.
ChEMBL_834356 (CHEMBL2073218)
IC50
96600±n/a nM
Citation
 Sánchez-Moreno, MMarín, CNavarro, PLamarque, LGarcía-España, EMiranda, CHuertas, OOlmo, FGómez-Contreras, FPitarch, JArrebola, F In vitro and in vivo trypanosomicidal activity of pyrazole-containing macrocyclic and macrobicyclic polyamines: their action on acute and chronic phases of Chagas disease. J Med Chem 55:4231-43 (2012)  
Target
Name:
Extracellular superoxide dismutase [Cu-Zn]
Synonyms:
EC-SOD SODE_HUMAN
Type:
PROTEIN
Mol. Mass.:
25851.14
Organism:
Homo sapiens (Human)
Description:
ChEMBL_834356
Residue:
240
  
Inhibitor
Name:
BDBM50389791
Synonyms:
CHEMBL2070383
Type:
Small organic molecule
Emp. Form.:
C20H38N10
Mol. Mass.:
418.5827
SMILES:
Cn1nc2CNCCNCCNCc3cc(CNCCNCCNCc1c2)nn3C
: