Target
Adenosine receptor A2b
Ligand
BDBM50389914
Substrate
Meas. Tech.
ChEMBL_834864 (CHEMBL2073181)
IC50
>5000±n/a nM
Citation
 Baraldi, PGSaponaro, GRomagnoli, RAghazadeh Tabrizi, MBaraldi, SMoorman, ARCosconati, SDi Maro, SMarinelli, LGessi, SMerighi, SVarani, KBorea, PAPreti, D Water-soluble pyrazolo[4,3-e][1,2,4]triazolo[1,5-c]pyrimidines as human A3 adenosine receptor antagonists. J Med Chem 55:5380-90 (2012)  
Target
Name:
Adenosine receptor A2b
Synonyms:
AA2BR_HUMAN ADORA2B Adenosine receptors A2b | Adenosine receptors; A2a & A2b
Type:
G Protein-Coupled Receptor (GPCR)
Mol. Mass.:
36341.22
Organism:
Homo sapiens (Human)
Description:
Residue:
332
  
Inhibitor
Name:
BDBM50389914
Synonyms:
CHEMBL2071041
Type:
Small organic molecule
Emp. Form.:
C23H28N10O3
Mol. Mass.:
492.5336
SMILES:
Cn1cc2c(n1)nc(NC(=O)NC1CCN(CC1)C(=O)NC1CCCC1)n1nc(nc21)-c1ccco1
: