Target
Potassium voltage-gated channel subfamily H member 2
Ligand
BDBM50390029
Substrate
Meas. Tech.
ChEMBL_833999 (CHEMBL2072739)
IC50
4000±n/a nM
Citation
 Packiarajan, MMazza Ferreira, CGHong, SPWhite, ADChandrasena, GPu, XBrodbeck, RMRobichaud, AJ N-Aryl pyrrolidinonyl oxadiazoles as potent mGluR5 positive allosteric modulators. Bioorg Med Chem Lett 22:5658-62 (2012)  
Target
Name:
Potassium voltage-gated channel subfamily H member 2
Synonyms:
1,3-beta-glucan synthase component GLS2 ERG Eag-related protein 1 Ether-a-go-go-related gene (HERG) Ether-a-go-go-related gene potassium channel 1 Ether-a-go-go-related gene potassium channel 1 (hERG1) Ether-a-go-go-related protein 1 H-ERG KCNH2 Potassium voltage-gated channel subfamily H member 2 (hERG) Voltage-gated potassium channel subunit Kv11.1 hERG Potassium Channel 1 | putative potassium channel subunit
Type:
Multi-pass membrane protein
Mol. Mass.:
126672.65
Organism:
Homo sapiens (Human)
Description:
Q12809
Residue:
1159
  
Inhibitor
Name:
BDBM50390029
Synonyms:
CHEMBL2069397
Type:
Small organic molecule
Emp. Form.:
C18H13ClFN3O2
Mol. Mass.:
357.766
SMILES:
Fc1ccc(cc1)N1CC(CC1=O)c1nc(no1)-c1cccc(Cl)c1
: