Target
Metabotropic glutamate receptor 5
Ligand
BDBM50390043
Substrate
Meas. Tech.
ChEMBL_833990 (CHEMBL2072730)
EC50
88±n/a nM
Citation
 Packiarajan, MMazza Ferreira, CGHong, SPWhite, ADChandrasena, GPu, XBrodbeck, RMRobichaud, AJ N-Aryl pyrrolidinonyl oxadiazoles as potent mGluR5 positive allosteric modulators. Bioorg Med Chem Lett 22:5658-62 (2012)  
Target
Name:
Metabotropic glutamate receptor 5
Synonyms:
GPRC1E GRM5_HUMAN metabotropic glutamate 5 | metabotropic glutamate 5a
Type:
Enzyme
Mol. Mass.:
132484.72
Organism:
Homo sapiens (Human)
Description:
Residue:
1212
  
Inhibitor
Name:
BDBM50390043
Synonyms:
CHEMBL2071581
Type:
Small organic molecule
Emp. Form.:
C18H13F2N3O2
Mol. Mass.:
341.3115
SMILES:
Fc1ccc(cc1)N1CC(CC1=O)c1nc(no1)-c1cccc(F)c1
: