Target
Metabotropic glutamate receptor 5
Ligand
BDBM50390028
Substrate
Meas. Tech.
ChEMBL_833990 (CHEMBL2072730)
EC50
12.5±n/a nM
Citation
 Packiarajan, MMazza Ferreira, CGHong, SPWhite, ADChandrasena, GPu, XBrodbeck, RMRobichaud, AJ N-Aryl pyrrolidinonyl oxadiazoles as potent mGluR5 positive allosteric modulators. Bioorg Med Chem Lett 22:5658-62 (2012)  
Target
Name:
Metabotropic glutamate receptor 5
Synonyms:
GPRC1E GRM5_HUMAN metabotropic glutamate 5 | metabotropic glutamate 5a
Type:
Enzyme
Mol. Mass.:
132484.72
Organism:
Homo sapiens (Human)
Description:
Residue:
1212
  
Inhibitor
Name:
BDBM50390028
Synonyms:
CHEMBL2069398
Type:
Small organic molecule
Emp. Form.:
C19H16FN3O2
Mol. Mass.:
337.3476
SMILES:
Cc1cccc(c1)-c1noc(n1)C1CN(C(=O)C1)c1ccc(F)cc1
: