Target
Metabotropic glutamate receptor 5
Ligand
BDBM50390062
Substrate
Meas. Tech.
ChEMBL_833991 (CHEMBL2072731)
IC50
1100±n/a nM
Citation
 Packiarajan, MMazza Ferreira, CGHong, SPWhite, ADChandrasena, GPu, XBrodbeck, RMRobichaud, AJ N-Aryl pyrrolidinonyl oxadiazoles as potent mGluR5 positive allosteric modulators. Bioorg Med Chem Lett 22:5658-62 (2012)  
Target
Name:
Metabotropic glutamate receptor 5
Synonyms:
GPRC1E GRM5_HUMAN metabotropic glutamate 5 | metabotropic glutamate 5a
Type:
Enzyme
Mol. Mass.:
132484.72
Organism:
Homo sapiens (Human)
Description:
Residue:
1212
  
Inhibitor
Name:
BDBM50390062
Synonyms:
CHEMBL2069392
Type:
Small organic molecule
Emp. Form.:
C16H10ClN3O2S
Mol. Mass.:
343.788
SMILES:
Clc1cccc(c1)-c1noc(Cn2c3ccccc3sc2=O)n1
: