Target
Metabotropic glutamate receptor 5
Ligand
BDBM50390066
Substrate
Meas. Tech.
ChEMBL_833991 (CHEMBL2072731)
IC50
550±n/a nM
Citation
 Packiarajan, MMazza Ferreira, CGHong, SPWhite, ADChandrasena, GPu, XBrodbeck, RMRobichaud, AJ N-Aryl pyrrolidinonyl oxadiazoles as potent mGluR5 positive allosteric modulators. Bioorg Med Chem Lett 22:5658-62 (2012)  
Target
Name:
Metabotropic glutamate receptor 5
Synonyms:
GPRC1E GRM5_HUMAN metabotropic glutamate 5 | metabotropic glutamate 5a
Type:
Enzyme
Mol. Mass.:
132484.72
Organism:
Homo sapiens (Human)
Description:
Residue:
1212
  
Inhibitor
Name:
BDBM50390066
Synonyms:
CHEMBL2069396
Type:
Small organic molecule
Emp. Form.:
C19H15Cl2N3O2
Mol. Mass.:
388.247
SMILES:
Clc1cccc(c1)-c1noc(CCN2C(=O)CCc3ccc(Cl)cc23)n1
: