Target
Cytochrome P450 2C19
Ligand
BDBM50390028
Substrate
Meas. Tech.
ChEMBL_833996 (CHEMBL2072736)
IC50
>11000±n/a nM
Citation
 Packiarajan, MMazza Ferreira, CGHong, SPWhite, ADChandrasena, GPu, XBrodbeck, RMRobichaud, AJ N-Aryl pyrrolidinonyl oxadiazoles as potent mGluR5 positive allosteric modulators. Bioorg Med Chem Lett 22:5658-62 (2012)  
Target
Name:
Cytochrome P450 2C19
Synonyms:
(R)-limonene 6-monooxygenase (S)-limonene 7-monooxygenase CYP2C19 CYPIIC19 Cytochrome P450 2C19 [I331V] Cytochrome P450-254C Mephenytoin 4-hydroxylase P450-254C
Type:
Enzyme
Mol. Mass.:
55935.47
Organism:
Homo sapiens (Human)
Description:
P33261
Residue:
490
  
Inhibitor
Name:
BDBM50390028
Synonyms:
CHEMBL2069398
Type:
Small organic molecule
Emp. Form.:
C19H16FN3O2
Mol. Mass.:
337.3476
SMILES:
Cc1cccc(c1)-c1noc(n1)C1CN(C(=O)C1)c1ccc(F)cc1
: