Target
Metabotropic glutamate receptor 5
Ligand
BDBM50390069
Substrate
Meas. Tech.
ChEMBL_833991 (CHEMBL2072731)
IC50
920±n/a nM
Citation
 Packiarajan, MMazza Ferreira, CGHong, SPWhite, ADChandrasena, GPu, XBrodbeck, RMRobichaud, AJ N-Aryl pyrrolidinonyl oxadiazoles as potent mGluR5 positive allosteric modulators. Bioorg Med Chem Lett 22:5658-62 (2012)  
Target
Name:
Metabotropic glutamate receptor 5
Synonyms:
GPRC1E GRM5_HUMAN metabotropic glutamate 5 | metabotropic glutamate 5a
Type:
Enzyme
Mol. Mass.:
132484.72
Organism:
Homo sapiens (Human)
Description:
Residue:
1212
  
Inhibitor
Name:
BDBM50390069
Synonyms:
CHEMBL2069389
Type:
Small organic molecule
Emp. Form.:
C16H18ClN3O2
Mol. Mass.:
319.786
SMILES:
CC(C)CN1CC(CC1=O)c1nc(no1)-c1cccc(Cl)c1
: