Target
Lysine--tRNA ligase
Ligand
BDBM50390571
Substrate
Meas. Tech.
ChEMBL_835320 (CHEMBL2072026)
IC50
10±n/a nM
Citation
 Castillo, MForns, PErra, MMir, MLópez, MMaldonado, MOrellana, ACarreño, CRamis, IMiralpeix, MVidal, B Highly potent aminopyridines as Syk kinase inhibitors. Bioorg Med Chem Lett 22:5419-23 (2012)  
Target
Name:
Lysine--tRNA ligase
Synonyms:
KARS KIAA0070 SYK_HUMAN
Type:
PROTEIN
Mol. Mass.:
68044.78
Organism:
Homo sapiens (Human)
Description:
ChEMBL_960665
Residue:
597
  
Inhibitor
Name:
BDBM50390571
Synonyms:
CHEMBL2069360
Type:
Small organic molecule
Emp. Form.:
C25H23N9O3
Mol. Mass.:
497.5086
SMILES:
OC(=O)c1ccc(cn1)C(=O)Nc1cc(Nc2cnccn2)nc(c1)-c1ccnc(c1)N1CCNCC1
: