Target
Carbonic anhydrase 1
Ligand
BDBM50115579
Substrate
Meas. Tech.
ChEMBL_835654 (CHEMBL2071765)
Ki
3350±n/a nM
Citation
 Sechi, MInnocenti, APala, NRogolino, DCarcelli, MScozzafava, ASupuran, CT Inhibition ofa-class cytosolic human carbonic anhydrases I, II, IX and XII, andß-class fungal enzymes by carboxylic acids and their derivatives: new isoform-I selective nanomolar inhibitors. Bioorg Med Chem Lett 22:5801-6 (2012)  
Target
Name:
Carbonic anhydrase 1
Synonyms:
CA-I CAB Carbonate dehydratase I Carbonic anhydrase 1 (CA I) Carbonic anhydrase 1 (Recombinant CA I) Carbonic anhydrase B Carbonic anhydrase I (CA I) Carbonic anhydrase I (CAI) Carbonic anhydrase isoenzyme I (hCA I) | hCA
Type:
Enzyme
Mol. Mass.:
28873.37
Organism:
Homo sapiens (Human)
Description:
P00915
Residue:
261
  
Inhibitor
Name:
BDBM50115579
Synonyms:
(Z)-2-hydroxy-4-oxo-4-phenyl-but-2-enoic acid 2-Hydroxy-4-oxo-4-phenyl-but-2-enoic acid (0.25H2O) CHEMBL19332 Sacchettini_CTRL
Type:
Small organic molecule
Emp. Form.:
C10H8O4
Mol. Mass.:
192.1681
SMILES:
OC(=O)C(=O)CC(=O)c1ccccc1
: