Target
Carbonic anhydrase 2
Ligand
BDBM50390686
Substrate
Meas. Tech.
ChEMBL_835655 (CHEMBL2071766)
Ki
4140±n/a nM
Citation
 Sechi, MInnocenti, APala, NRogolino, DCarcelli, MScozzafava, ASupuran, CT Inhibition ofa-class cytosolic human carbonic anhydrases I, II, IX and XII, andß-class fungal enzymes by carboxylic acids and their derivatives: new isoform-I selective nanomolar inhibitors. Bioorg Med Chem Lett 22:5801-6 (2012)  
Target
Name:
Carbonic anhydrase 2
Synonyms:
CA-II CAC Carbonate dehydratase II Carbonic anhydrase 2 (CA-II) Carbonic anhydrase C Carbonic anhydrase II (CA-II) Carbonic anhydrase II (hCA II) | Carbonic anhydrase isoenzyme II (hCA II)
Type:
Enzyme
Mol. Mass.:
29250.71
Organism:
Homo sapiens (Human)
Description:
P00918
Residue:
260
  
Inhibitor
Name:
BDBM50390686
Synonyms:
CHEMBL2070212
Type:
Small organic molecule
Emp. Form.:
C17H13NO4
Mol. Mass.:
295.2894
SMILES:
COC(=O)C(=O)C1C(=O)N(c2ccccc12)c1ccccc1
: