Target
Oxysterols receptor LXR-beta
Ligand
BDBM50390741
Substrate
Meas. Tech.
ChEMBL_835704 (CHEMBL2071815)
IC50
1700±n/a nM
Citation
 Jiao, XKopecky, DJFisher, BPiper, DELabelle, MMcKendry, SHarrison, MJones, SJaen, JShiau, AKEscaron, PDanao, JChai, ACoward, PKayser, F Discovery and optimization of a series of liver X receptor antagonists. Bioorg Med Chem Lett 22:5966-70 (2012)  
Target
Name:
Oxysterols receptor LXR-beta
Synonyms:
LXRB Liver X, LXR beta NR1H2 Nuclear receptor NER Ubiquitously-expressed nuclear receptor
Type:
Enzyme Catalytic Domain
Mol. Mass.:
50978.79
Organism:
Homo sapiens (Human)
Description:
P55055
Residue:
460
  
Inhibitor
Name:
BDBM50390741
Synonyms:
CHEMBL2070364
Type:
Small organic molecule
Emp. Form.:
C25H26F3N3O3S
Mol. Mass.:
505.552
SMILES:
CCn1cc(cn1)C#CC(O)(c1ccc(cc1)N(CC(C)C)S(=O)(=O)c1ccccc1)C(F)(F)F
: