Target
Solute carrier family 22 member 7
Ligand
BDBM82898
Substrate
Meas. Tech.
ChEMBL_835958 (CHEMBL2077096)
IC50
1500000±n/a nM
Citation
 Khamdang, STakeda, MBabu, ENoshiro, ROnozato, MLTojo, AEnomoto, AHuang, XLNarikawa, SAnzai, NPiyachaturawat, PEndou, H Interaction of human and rat organic anion transporter 2 with various cephalosporin antibiotics. Eur J Pharmacol 465:1-7 (2003)  
Target
Name:
Solute carrier family 22 member 7
Synonyms:
Nlt Oat2 S22A7_RAT | Slc22a7
Type:
PROTEIN
Mol. Mass.:
58654.52
Organism:
Rattus norvegicus
Description:
ChEMBL_836967
Residue:
535
  
Inhibitor
Name:
BDBM82898
Synonyms:
(6R,7R)-3-(acetoxymethyl)-8-keto-7-[[2-(2-thienyl)acetyl]amino]-5-thia-1-azabicyclo[4.2.0]oct-2-ene-2-carboxylic acid (6R,7R)-3-(acetyloxymethyl)-8-oxo-7-[(1-oxo-2-thiophen-2-ylethyl)amino]-5-thia-1-azabicyclo[4.2.0]oct-2-ene-2-carboxylic acid Cephalothin SMR000386987 | cid_6024
Type:
Small organic molecule
Emp. Form.:
C16H16N2O6S2
Mol. Mass.:
396.438
SMILES:
CC(=O)OCC1=C(N2[C@H](SC1)[C@H](NC(=O)Cc1cccs1)C2=O)C(O)=O
: