Target
Solute carrier family 22 member 11
Ligand
BDBM50206509
Substrate
Meas. Tech.
ChEMBL_836112 (CHEMBL2077548)
IC50
25400±n/a nM
Citation
 Khamdang, STakeda, MShimoda, MNoshiro, RNarikawa, SHuang, XLEnomoto, APiyachaturawat, PEndou, H Interactions of human- and rat-organic anion transporters with pravastatin and cimetidine. J Pharmacol Sci 94:197-202 (2004)  
Target
Name:
Solute carrier family 22 member 11
Synonyms:
OAT4 S22AB_HUMAN | SLC22A11
Type:
PROTEIN
Mol. Mass.:
59982.54
Organism:
Homo sapiens (Human)
Description:
ChEMBL_838708
Residue:
550
  
Inhibitor
Name:
BDBM50206509
Synonyms:
4-Dipropylsulfamoyl-benzoic acid 4-Dipropylsulfamoyl-benzoic acid(probenecid) CHEMBL897 Probalan
Type:
Small organic molecule
Emp. Form.:
C13H19NO4S
Mol. Mass.:
285.359
SMILES:
CCCN(CCC)S(=O)(=O)c1ccc(cc1)C(O)=O
: