Target
Solute carrier family 15 member 1
Ligand
BDBM50370585
Substrate
Meas. Tech.
ChEMBL_836147 (CHEMBL2077583)
IC50
15000000±n/a nM
Citation
 Han, Hde Vrueh, RLRhie, JKCovitz, KMSmith, PLLee, CPOh, DMSadée, WAmidon, GL 5'-Amino acid esters of antiviral nucleosides, acyclovir, and AZT are absorbed by the intestinal PEPT1 peptide transporter. Pharm Res 15:1154-9 (1998)  
Target
Name:
Solute carrier family 15 member 1
Synonyms:
Intestinal H(+)/peptide cotransporter Oligopeptide transporter, small intestine isoform Peptide transporter 1 SLC15A1
Type:
PROTEIN
Mol. Mass.:
78818.07
Organism:
Homo sapiens (Human)
Description:
ChEMBL_1488839
Residue:
708
  
Inhibitor
Name:
BDBM50370585
Synonyms:
Anspor Cefradine
Type:
Small organic molecule
Emp. Form.:
C16H19N3O4S
Mol. Mass.:
349.405
SMILES:
CC1=C(N2[C@H](SC1)[C@H](NC(=O)[C@H](N)C1=CCC=CC1)C2=O)C(O)=O
: