Target
Polyunsaturated fatty acid lipoxygenase ALOX15
Ligand
BDBM50391174
Substrate
Meas. Tech.
ChEMBL_840271 (CHEMBL2091179)
IC50
>50000±n/a nM
Citation
 Iranshahi, MJabbari, AOrafaie, AMehri, RZeraatkar, SAhmadi, TAlimardani, MSadeghian, H Synthesis and SAR studies of mono O-prenylated coumarins as potent 15-lipoxygenase inhibitors. Eur J Med Chem 57:134-42 (2012)  
Target
Name:
Polyunsaturated fatty acid lipoxygenase ALOX15
Synonyms:
15-Lipoxygenase-1 (15-LOX-1) Arachidonate 15-lipoxygenase LOG15 Reticulocyte 15-lipoxygenase-1 | Sphingosine 1-phosphate receptor 1 (S1P1)
Type:
Protein
Mol. Mass.:
74804.05
Organism:
Homo sapiens (Human)
Description:
Residue:
662
  
Inhibitor
Name:
BDBM50391174
Synonyms:
CHEMBL1834532
Type:
Small organic molecule
Emp. Form.:
C24H30O3
Mol. Mass.:
366.4932
SMILES:
[#6]\[#6](-[#6])=[#6]\[#6]-[#6]\[#6](-[#6])=[#6]\[#6]-[#6]\[#6](-[#6])=[#6]\[#6]-[#8]-c1cc2ccccc2oc1=O
: