Target
Vascular endothelial growth factor receptor 1
Ligand
BDBM50391643
Substrate
Meas. Tech.
ChEMBL_847957 (CHEMBL2150257)
IC50
>10000±n/a nM
Citation
 Kawakita, YMiwa, KSeto, MBanno, HOhta, YTamura, TYusa, TMiki, HKamiguchi, HIkeda, YTanaka, TKamiyama, KIshikawa, T Design and synthesis of pyrrolo[3,2-d]pyrimidine HER2/EGFR dual inhibitors: improvement of the physicochemical and pharmacokinetic profiles for potent in vivo anti-tumor efficacy. Bioorg Med Chem 20:6171-80 (2012)  
Target
Name:
Vascular endothelial growth factor receptor 1
Synonyms:
FLT FRT Fms-like tyrosine kinase 1 Tyrosine-protein kinase FRT VEGFR-1 VGFR1_HUMAN Vascular endothelial growth factor receptor 1 (FLT1) Vascular endothelial growth factor receptor 1 and 2 (Flt-1 and KDR) Vascular permeability factor receptor vascular endothelial growth factor/vascular permeability factor receptor
Type:
Receptor Tyrosine Kinase
Mol. Mass.:
150800.23
Organism:
Homo sapiens (Human)
Description:
P17948
Residue:
1338
  
Inhibitor
Name:
BDBM50391643
Synonyms:
CHEMBL2148052 | CHEMBL2148053
Type:
Small organic molecule
Emp. Form.:
C25H25Cl2N5O4S
Mol. Mass.:
562.468
SMILES:
CC(C)(C(=O)NCCn1ccc2ncnc(Nc3ccc(Oc4cccc(Cl)c4)c(Cl)c3)c12)S(C)(=O)=O
: