Target
Cytoplasmic tyrosine-protein kinase BMX
Ligand
BDBM50391643
Substrate
Meas. Tech.
ChEMBL_847983 (CHEMBL2150419)
IC50
>10000±n/a nM
Citation
 Kawakita, YMiwa, KSeto, MBanno, HOhta, YTamura, TYusa, TMiki, HKamiguchi, HIkeda, YTanaka, TKamiyama, KIshikawa, T Design and synthesis of pyrrolo[3,2-d]pyrimidine HER2/EGFR dual inhibitors: improvement of the physicochemical and pharmacokinetic profiles for potent in vivo anti-tumor efficacy. Bioorg Med Chem 20:6171-80 (2012)  
Target
Name:
Cytoplasmic tyrosine-protein kinase BMX
Synonyms:
BMX BMX_HUMAN Cytoplasmic tyrosine-protein kinase BMX (BMX) Epithelial and endothelial tyrosine kinase Tyrosine Kinase BMX | Tyrosine-protein kinase BMX/ETK
Type:
Tyrosine-protein kinase
Mol. Mass.:
78030.42
Organism:
Homo sapiens (Human)
Description:
P51813
Residue:
675
  
Inhibitor
Name:
BDBM50391643
Synonyms:
CHEMBL2148052 | CHEMBL2148053
Type:
Small organic molecule
Emp. Form.:
C25H25Cl2N5O4S
Mol. Mass.:
562.468
SMILES:
CC(C)(C(=O)NCCn1ccc2ncnc(Nc3ccc(Oc4cccc(Cl)c4)c(Cl)c3)c12)S(C)(=O)=O
: