Target
Dual specificity protein kinase TTK
Ligand
BDBM50391643
Substrate
Meas. Tech.
ChEMBL_847969 (CHEMBL2150269)
IC50
>10000±n/a nM
Citation
 Kawakita, YMiwa, KSeto, MBanno, HOhta, YTamura, TYusa, TMiki, HKamiguchi, HIkeda, YTanaka, TKamiyama, KIshikawa, T Design and synthesis of pyrrolo[3,2-d]pyrimidine HER2/EGFR dual inhibitors: improvement of the physicochemical and pharmacokinetic profiles for potent in vivo anti-tumor efficacy. Bioorg Med Chem 20:6171-80 (2012)  
Target
Name:
Dual specificity protein kinase TTK
Synonyms:
Dual specificity protein kinase (TTK) MPS1 Monopolar Spindle 1 (MPS1) Monopolar Spindle 1 Kinase (MPS1) TTK | TTK_HUMAN
Type:
Protein
Mol. Mass.:
97086.79
Organism:
Homo sapiens (Human)
Description:
P33981
Residue:
857
  
Inhibitor
Name:
BDBM50391643
Synonyms:
CHEMBL2148052 | CHEMBL2148053
Type:
Small organic molecule
Emp. Form.:
C25H25Cl2N5O4S
Mol. Mass.:
562.468
SMILES:
CC(C)(C(=O)NCCn1ccc2ncnc(Nc3ccc(Oc4cccc(Cl)c4)c(Cl)c3)c12)S(C)(=O)=O
: