Target
Muscarinic acetylcholine receptor M5
Ligand
BDBM50347783
Substrate
Meas. Tech.
ChEMBL_849491 (CHEMBL2149598)
EC50
794.33±n/a nM
Citation
 Budzik, BGarzya, VShi, DWalker, GWoolley-Roberts, MPardoe, JLucas, ATehan, BRivero, RALangmead, CJWatson, JWu, ZForbes, ITJin, J Novel N-Substituted Benzimidazolones as Potent, Selective, CNS-Penetrant, and Orally Active M1 mAChR Agonists. ACS Med Chem Lett 1:244-248 (2010)  
Target
Name:
Muscarinic acetylcholine receptor M5
Synonyms:
ACM5_HUMAN | CHRM5
Type:
PROTEIN
Mol. Mass.:
60102.35
Organism:
Homo sapiens (Human)
Description:
ChEMBL_1517990
Residue:
532
  
Inhibitor
Name:
BDBM50347783
Synonyms:
CHEMBL1223753
Type:
Small organic molecule
Emp. Form.:
C18H24FN3O2
Mol. Mass.:
333.4005
SMILES:
Cc1cc2n(C3CCN(CC3)C3CCOCC3)c(=O)[nH]c2cc1F
: