Target
Hypoxanthine-guanine phosphoribosyltransferase
Ligand
BDBM50392265
Substrate
Meas. Tech.
ChEMBL_850551 (CHEMBL2157773)
Ki
150±n/a nM
Citation
 Hocková, DKeough, DTJaneba, ZWang, THde Jersey, JGuddat, LW Synthesis of novel N-branched acyclic nucleoside phosphonates as potent and selective inhibitors of human, Plasmodium falciparum and Plasmodium vivax 6-oxopurine phosphoribosyltransferases. J Med Chem 55:6209-23 (2012)  
Target
Name:
Hypoxanthine-guanine phosphoribosyltransferase
Synonyms:
HGPRT HPRT HPRT_HUMAN Hypoxanthine-guanine phosphoribosyltransferase (HGPRT)
Type:
Protein
Mol. Mass.:
24579.61
Organism:
Homo sapiens (Human)
Description:
P00492
Residue:
218
  
Inhibitor
Name:
BDBM50392265
Synonyms:
CHEMBL2153483
Type:
Small organic molecule
Emp. Form.:
C12H19N6O6P
Mol. Mass.:
374.2896
SMILES:
Nc1nc2n(CCN(CCC(O)=O)CCP(O)(O)=O)cnc2c(=O)[nH]1
: