Target
Methionine synthase
Ligand
BDBM50392661
Substrate
Meas. Tech.
ChEMBL_854111 (CHEMBL2153942)
IC50
15870±n/a nM
Citation
 Zhang, ZTian, CZhou, SWang, WGuo, YXia, JLiu, ZWang, BWang, XGolding, BTGriff, RJDu, YLiu, J Mechanism-based design, synthesis and biological studies of N5-substituted tetrahydrofolate analogs as inhibitors of cobalamin-dependent methionine synthase and potential anticancer agents. Eur J Med Chem 58:228-36 (2012)  
Target
Name:
Methionine synthase
Synonyms:
5-methyltetrahydrofolate--homocysteine methyltransferase MS Vitamin-B12 dependent methionine synthase
Type:
PROTEIN
Mol. Mass.:
140503.96
Organism:
Homo sapiens (Human)
Description:
ChEMBL_854111
Residue:
1265
  
Inhibitor
Name:
BDBM50392661
Synonyms:
CHEMBL2153703
Type:
Small organic molecule
Emp. Form.:
C26H33N7O5
Mol. Mass.:
523.5841
SMILES:
Nc1nc(N)c2N(CC=C)C(CN(CC=C)c3ccc(cc3)C(=O)N[C@@H](CCC(O)=O)C(O)=O)CCc2n1
: